[an error occurred while processing this directive] [an error occurred while processing this directive][an error occurred while processing this directive] [an error occurred while processing this directive] [an error occurred while processing this directive] [an error occurred while processing this directive] (none) [an error occurred while processing this directive] [an error occurred while processing this directive] [an error occurred while processing this directive] [an error occurred while processing this directive] [an error occurred while processing this directive][an error occurred while processing this directive] [an error occurred while processing this directive][an error occurred while processing this directive] [an error occurred while processing this directive][an error occurred while processing this directive] [an error occurred while processing this directive] [an error occurred while processing this directive] [an error occurred while processing this directive] (none) [an error occurred while processing this directive] [an error occurred while processing this directive] [an error occurred while processing this directive][an error occurred while processing this directive]
 
[an error occurred while processing this directive] [an error occurred while processing this directive]
Skåne Sjælland Linux User Group - http://www.sslug.dk Home   Subscribe   Mail Archive   Forum   Calendar   Search
MhonArc Date: [Date Prev] [Date Index] [Date Next]   Thread: [Date Prev] [Thread Index] [Date Next]   MhonArc
 

Kompilering af kernen bliver afbrudt



Kere Linux drenge !
Kompilering af kernen bliver afbrudt med:

gcc -D__KERNEL__ -I/usr/src/linux-2.0.36/include -Wall -Wstrict-prototypes 
-O2 -fomit-frame-pointer -fno-strength-reduce -pipe -m486 -malign-loops=2 
-malign-jumps=2 -malign-functions=2 -DCPU=586  -c -o delay.o delay.c
delay.c:21: conflicting types for `__delay'
/usr/src/linux-2.0.36/include/asm/delay.h:19: previous declaration of 
`__delay'
delay.c: In function `__const_udelay':
delay.c:37: `current_cpu_data' undeclared (first use this function)
delay.c:37: (Each undeclared identifier is reported only once
delay.c:37: for each function it appears in.)
make[2]: *** [delay.o] Error 1
make[2]: Leaving directory `/usr/src/linux-2.0.36/arch/i386/lib'
make[1]: *** [first_rule] Error 2
make[1]: Leaving directory `/usr/src/linux-2.0.36/arch/i386/lib'
make: *** [linuxsubdirs] Error 2

Hvad kan der vere galt ?

Med venlig hilsen

Niels Kolloff


 
Home   Subscribe   Mail Archive   Index   Calendar   Search

 
 
Questions about the web-pages to <www_admin>. Last modified 2005-08-10, 20:56 CEST [an error occurred while processing this directive]
This page is maintained by [an error occurred while processing this directive]MHonArc [an error occurred while processing this directive] # [an error occurred while processing this directive] *